Target
5-hydroxytryptamine receptor 1E
Ligand
BDBM31025
Substrate
Not Available
Meas. Tech.
Dose Response Cell Based High Throughput Screening Assay for Agonists of the 5-Hydroxytryptamine Receptor Subtype 1E (5HT1E)
pH
7.4±n/a
Temperature
296.15±n/a K
EC50
3502±n/a nM
Citation
 PubChem, PC Dose Response Cell Based High Throughput Screening Assay for Agonists of the 5-Hydroxytryptamine Receptor Subtype 1E (5HT1E) PubChem Bioassay (2007)[AID] 
Target
Name:
5-hydroxytryptamine receptor 1E
Synonyms:
5-HT-1E 5-Hydroxytryptamine Receptor Subtype 1E (5HT1E) 5-hydroxytryptamine receptor 1E (5-HT-1E) (S31) 5HT1E_HUMAN S31 Serotonin 1e (5-HT1e) receptor | Serotonin Receptor 1E
Type:
G Protein-Coupled Receptor (GPCR)
Mol. Mass.:
41697.80
Organism:
Homo sapiens (Human)
Description:
gi_112822
Residue:
365
  
Inhibitor
Name:
BDBM31025
Synonyms:
MLS000086722 N-[3-[butyl(methyl)amino]propyl]-2-(2-oxidanylidene-1,3-benzothiazol-3-yl)ethanamide N-{3-[butyl(methyl)amino]propyl}-2-(2-oxo-1,3-benzothiazol-3(2H)-yl)acetamide cid_3239520
Type:
Small organic molecule
Emp. Form.:
C17H25N3O2S
Mol. Mass.:
335.464
SMILES:
CCCCN(C)CCCNC(=O)Cn1c2ccccc2sc1=O
:
Substrate
Name:
Not Available
Synonyms:
Type:
Mol. Mass.:
358.43
Organism:
Description:
Residue:
3
NA