Target
5-hydroxytryptamine receptor 1E
Ligand
BDBM31038
Substrate
Not Available
Meas. Tech.
Dose Response Cell Based High Throughput Screening Assay for Agonists of the 5-Hydroxytryptamine Receptor Subtype 1E (5HT1E)
pH
7.4±n/a
Temperature
296.15±n/a K
EC50
50000±n/a nM
Citation
 PubChem, PC Dose Response Cell Based High Throughput Screening Assay for Agonists of the 5-Hydroxytryptamine Receptor Subtype 1E (5HT1E) PubChem Bioassay (2007)[AID] 
Target
Name:
5-hydroxytryptamine receptor 1E
Synonyms:
5-HT-1E 5-Hydroxytryptamine Receptor Subtype 1E (5HT1E) 5-hydroxytryptamine receptor 1E (5-HT-1E) (S31) 5HT1E_HUMAN S31 Serotonin 1e (5-HT1e) receptor | Serotonin Receptor 1E
Type:
G Protein-Coupled Receptor (GPCR)
Mol. Mass.:
41697.80
Organism:
Homo sapiens (Human)
Description:
gi_112822
Residue:
365
  
Inhibitor
Name:
BDBM31038
Synonyms:
4-[[4-(2,3-dimethylphenyl)-1-piperazinyl]methyl]-2,6-dimethoxyphenol 4-[[4-(2,3-dimethylphenyl)piperazin-1-yl]methyl]-2,6-dimethoxyphenol MLS000105319 cid_1377033
Type:
Small organic molecule
Emp. Form.:
C21H28N2O3
Mol. Mass.:
356.4586
SMILES:
COc1cc(CN2CCN(CC2)c2cccc(C)c2C)cc(OC)c1O
:
Substrate
Name:
Not Available
Synonyms:
Type:
Mol. Mass.:
358.43
Organism:
Description:
Residue:
3
NA