Target
Replicase polyprotein 1ab [1541-1855]
Ligand
BDBM31525
Substrate
SARS-CoV PLpro Substrate Peptide
Meas. Tech.
SARS-CoV PLpro Enzyme Inhibition Assay
pH
7.5±n/a
Temperature
296.15±n/a K
IC50
11100±1300 nM
Citation
 Ghosh, AKTakayama, JAubin, YRatia, KChaudhuri, RBaez, YSleeman, KCoughlin, MNichols, DBMulhearn, DCPrabhakar, BSBaker, SCJohnson, MEMesecar, AD Structure-Based Design, Synthesis, and Biological Evaluation of a Series of Novel and Reversible Inhibitors for the Severe Acute Respiratory Syndrome-Coronavirus Papain-Like Protease. J Med Chem 52:5228-40 (2009)  
Target
Name:
Replicase polyprotein 1ab [1541-1855]
Synonyms:
R1AB_SARS SARS-CoV PLpro rep
Type:
Hydrolase
Mol. Mass.:
35352.30
Organism:
Human SARS coronavirus (SARS-CoV)
Description:
The SARS-CoV PLpro enzyme (residues 1541 -1855) was expressed and purified from E. coli.
Residue:
315
  
Inhibitor
Name:
BDBM31525
Synonyms:
Substituted Benzamide Derivative, 29 | med.21724, Compound 161
Type:
Small organic molecule
Emp. Form.:
C21H22N2O
Mol. Mass.:
318.4122
SMILES:
Cc1ccc(N)cc1C(=O)NC(C)(C)c1cccc2ccccc12
:
Substrate
Name:
SARS-CoV PLpro Substrate Peptide
Synonyms:
Arg-Leu-Arg-Gly-Gly-AMC
Type:
Fluorogenic peptide
Mol. Mass.:
865.08
Organism:
Description:
Residue:
8
RLRGGAMC