Target
Dimer of Gag-Pol polyprotein [501-599]
Ligand
BDBM723
Substrate
Peptide substrate
Meas. Tech.
Protease Inhibition Assay
pH
5.5±n/a
Temperature
303.15±n/a K
IC50
0.3±n/a nM
Citation
 Smith, ABCantin, LDPasternak, AGuise-Zawacki, LYao, WCharnley, AKBarbosa, JSprengeler, PAHirschmann, RMunshi, SOlsen, DBSchleif, WAKuo, LC Design, synthesis, and biological evaluation of monopyrrolinone-based HIV-1 protease inhibitors. J Med Chem 46:1831-44 (2003)  
Target
Name:
Dimer of Gag-Pol polyprotein [501-599]
Synonyms:
HIV-1 Protease | HIV-1 Protease, recombinant, isolate HXB2
Type:
Protein Complex
Mol. Mass.:
Description:
Components:
This complex has 2 components.
Component 1
Name:
Gag-Pol polyprotein [501-599]
Synonyms:
BRU isolated HIV-1 Protease B Subtype Chain B LAI(Wild type) Protease Retropepsin | gag-pol
Type:
Enzyme Subunit
Mol. Mass.:
10795.19
Organism:
Human immunodeficiency virus type 1
Description:
P03367[501-599]
Residue:
99
  
Component 2
Name:
Gag-Pol polyprotein [501-599]
Synonyms:
BRU isolated HIV-1 Protease B Subtype Chain B LAI(Wild type) Protease Retropepsin | gag-pol
Type:
Enzyme Subunit
Mol. Mass.:
10795.19
Organism:
Human immunodeficiency virus type 1
Description:
P03367[501-599]
Residue:
99
  
Inhibitor
Name:
BDBM723
Synonyms:
CHEMBL277908 tert-butyl N-[(2S,3S,5R)-5-benzyl-3-hydroxy-5-{[(2R)-2-hydroxy-2,3-dihydro-1H-inden-1-yl]carbamoyl}-1-phenylpentan-2-yl]carbamate
Type:
Small organic molecule
Emp. Form.:
C33H40N2O5
Mol. Mass.:
544.6811
SMILES:
[H][C@](C[C@H](O)[C@H](Cc1ccccc1)NC(=O)OC(C)(C)C)(Cc1ccccc1)C(=O)NC1[C@H](O)Cc2ccccc12
:
Substrate
Name:
Peptide substrate
Synonyms:
Type:
Peptide
Mol. Mass.:
755.86
Organism:
Description:
Residue:
7
VSQNPIV