Target
Heat shock 70 kDa protein 1A
Ligand
BDBM31713
Substrate
Fluorescein-12-ATP
Meas. Tech.
High Throughput Screening Assay for Hsp70 Inhibitors
pH
7±n/a
Temperature
296.15±n/a K
IC50
73300±n/a nM
Citation
 PubChem, PC High Throughput Screening Assay for Hsp70 Inhibitors PubChem Bioassay (2008)[AID] 
Target
Name:
Heat shock 70 kDa protein 1A
Synonyms:
HSPA1A V9GZ37_HUMAN | heat shock 70kDa protein 1A
Type:
ATP-binding protein
Mol. Mass.:
51937.99
Organism:
Homo sapiens (Human)
Description:
gi_123271505; GST-tagged ATPase domain
Residue:
476
  
Inhibitor
Name:
BDBM31713
Synonyms:
1-Cyclopropyl-3-(2,3-di-furan-2-yl-quinoxalin-6-yl)-urea 1-[2,3-bis(2-furyl)quinoxalin-6-yl]-3-cyclopropyl-urea 1-[2,3-bis(furan-2-yl)quinoxalin-6-yl]-3-cyclopropylurea SMR000118524 | cid_1072898
Type:
Small organic molecule
Emp. Form.:
C20H16N4O3
Mol. Mass.:
360.366
SMILES:
O=C(NC1CC1)Nc1ccc2nc(-c3ccco3)c(nc2c1)-c1ccco1
:
Substrate
Name:
Fluorescein-12-ATP
Synonyms:
Type:
Mol. Mass.:
358.43
Organism:
Description:
Residue:
3
NA