Target
Dual specificity protein phosphatase 6
Ligand
BDBM31741
Substrate
3-O-methylfluorescein phosphate (OMFP)
Meas. Tech.
In Vitro MKP-3 Dose Response Assay for SAR Study
pH
7±n/a
Temperature
296.15±n/a K
IC50
55800±n/a nM
Citation
 PubChem, PC In Vitro MKP-3 Dose Response Assay for SAR Study PubChem Bioassay (2008)[AID] 
Target
Name:
Dual specificity protein phosphatase 6
Synonyms:
DUS6_RAT MAP kinase phosphatase 3 Mitogen-activated protein kinase phosphatase 3 | Mkp3
Type:
Enzyme
Mol. Mass.:
42303.19
Organism:
Rattus norvegicus
Description:
gi_16758752
Residue:
381
  
Inhibitor
Name:
BDBM31741
Synonyms:
8-(2-methylpropoxycarbonyl)-3a,4,5,9b-tetrahydro-3H-cyclopenta[c]quinoline-4-carboxylic acid 8-isobutoxycarbonyl-3a,4,5,9b-tetrahydro-3H-cyclopenta[c]quinoline-4-carboxylic acid cid_2920908
Type:
Small organic molecule
Emp. Form.:
C18H21NO4
Mol. Mass.:
315.3636
SMILES:
CC(C)COC(=O)c1ccc2NC(C3CC=CC3c2c1)C(O)=O
:
Substrate
Name:
3-O-methylfluorescein phosphate (OMFP)
Synonyms:
Type:
Mol. Mass.:
358.43
Organism:
Description:
Residue:
3
NA