Target
Bcl-2-related protein A1
Ligand
BDBM31802
Substrate
FITC-conjugated-Bim BH3 Peptide
Meas. Tech.
Fluorescence Polarization Assay
Temperature
298.15±n/a K
IC50
>10000±n/a nM
Comments
extracted
Citation
 Wei, JKitada, SRega, MFStebbins, JLZhai, DCellitti, JYuan, HEmdadi, ADahl, RZhang, ZYang, LReed, JCPellecchia, M Apogossypol derivatives as pan-active inhibitors of antiapoptotic B-cell lymphoma/leukemia-2 (Bcl-2) family proteins. J Med Chem 52:4511-23 (2009)  
Target
Name:
Bcl-2-related protein A1
Synonyms:
B2LA1_HUMAN BCL2L5 Bcl-2-like protein 5 HBPA1 Protein BFL-1 | Protein GRS
Type:
Apoptosis regulator protein
Mol. Mass.:
20130.01
Organism:
Homo sapiens (Human)
Description:
Residue:
175
  
Inhibitor
Name:
BDBM31802
Synonyms:
Apogossypol | US9115061, Apogossypol
Type:
Small organic molecule
Emp. Form.:
C28H30O6
Mol. Mass.:
462.5342
SMILES:
CC(C)c1c(O)c(O)cc2c(O)c(c(C)cc12)-c1c(C)cc2c(C(C)C)c(O)c(O)cc2c1O
:
Substrate
Name:
FITC-conjugated-Bim BH3 Peptide
Synonyms:
FITC-Ahx-DMRPEIWIAQELRRIGDEFNAYYAR-OH
Type:
FITC-labeled Peptide
Mol. Mass.:
3112.46
Organism:
Description:
Residue:
25