Target
Dimer of Gag-Pol polyprotein [489-587]
Ligand
BDBM755
Substrate
Peptide substrate
Meas. Tech.
Protease Inhibition Assay
pH
5.5±n/a
Temperature
303.15±n/a K
IC50
1.4±n/a nM
Citation
 Vacca, JPGuare, JPdeSolms, SJSanders, WMGiuliani, EAYoung, SDDarke, PLZugay, JSigal, ISSchleif, WA L-687,908, a potent hydroxyethylene-containing HIV protease inhibitor. J Med Chem 34:1225-8 (1991)  
Target
Name:
Dimer of Gag-Pol polyprotein [489-587]
Synonyms:
HIV-1 Protease
Type:
Protein Complex
Mol. Mass.:
Description:
Components:
This complex has 2 components.
Component 1
Name:
Gag-Pol polyprotein [489-587]
Synonyms:
HIV protease HIV-1 Protease chain A POL_HV1N5 | gag-pol
Type:
Enzyme Subunit
Mol. Mass.:
10822.21
Organism:
Human immunodeficiency virus type 1
Description:
P12497[489-587]
Residue:
99
  
Component 2
Name:
Gag-Pol polyprotein [489-587]
Synonyms:
HIV protease HIV-1 Protease chain A POL_HV1N5 | gag-pol
Type:
Enzyme Subunit
Mol. Mass.:
10822.21
Organism:
Human immunodeficiency virus type 1
Description:
P12497[489-587]
Residue:
99
  
Inhibitor
Name:
BDBM755
Synonyms:
Hydroxyethylene deriv. 6 | tert-butyl N-[(2S,3S,5R)-5-benzyl-5-{[1-(benzylcarbamoyl)-3-methylbutyl]carbamoyl}-3-hydroxy-1-phenylpentan-2-yl]carbamate
Type:
Small organic molecule
Emp. Form.:
C37H49N3O5
Mol. Mass.:
615.8021
SMILES:
CC(C)CC(NC(=O)[C@@H](C[C@H](O)[C@H](Cc1ccccc1)NC(=O)OC(C)(C)C)Cc1ccccc1)C(=O)NCc1ccccc1
:
Substrate
Name:
Peptide substrate
Synonyms:
Type:
Peptide
Mol. Mass.:
755.86
Organism:
Description:
Residue:
7
VSQNPIV