Target
Dimer of Gag-Pol polyprotein [489-587]
Ligand
BDBM764
Substrate
Peptide Substrate
Meas. Tech.
Protease Inhibition Assay
pH
5±n/a
Temperature
295.15±n/a K
Ki
9±n/a nM
Citation
 Skulnick, HIJohnson, PDHowe, WJTomich, PKChong, KTWatenpaugh, KDJanakiraman, MNDolak, LAMcGrath, JPLynn, JC Structure-based design of sulfonamide-substituted non-peptidic HIV protease inhibitors. J Med Chem 38:4968-71 (1995)  
Target
Name:
Dimer of Gag-Pol polyprotein [489-587]
Synonyms:
HIV-1 Protease
Type:
Protein Complex
Mol. Mass.:
Description:
Components:
This complex has 2 components.
Component 1
Name:
Gag-Pol polyprotein [489-587]
Synonyms:
HIV protease HIV-1 Protease chain A POL_HV1N5 | gag-pol
Type:
Enzyme Subunit
Mol. Mass.:
10822.21
Organism:
Human immunodeficiency virus type 1
Description:
P12497[489-587]
Residue:
99
  
Component 2
Name:
Gag-Pol polyprotein [489-587]
Synonyms:
HIV protease HIV-1 Protease chain A POL_HV1N5 | gag-pol
Type:
Enzyme Subunit
Mol. Mass.:
10822.21
Organism:
Human immunodeficiency virus type 1
Description:
P12497[489-587]
Residue:
99
  
Inhibitor
Name:
BDBM764
Synonyms:
Cyclooctylpyranonesulfonamide deriv. 8c Sulfonamide-Substituted Cyclooctylpyranone deriv. 33a | U-103017 Analog
Type:
Small organic molecule
Emp. Form.:
C28H31NO5S
Mol. Mass.:
493.614
SMILES:
Cc1ccccc1S(=O)(=O)Nc1cccc(c1)C(C1CC1)c1c(O)c2CCCCCCc2oc1=O
:
Substrate
Name:
Peptide Substrate
Synonyms:
Type:
Peptide
Mol. Mass.:
1447.64
Organism:
Description:
The peptide was derivatized with biotin and fluorescein isothiocyanate at the amino and carboxy termini.
Residue:
12
RVSQNYPIVQNK