Target
Dimer of Gag-Pol polyprotein [501-599,M537I]
Ligand
BDBM518
Substrate
Chromogenic peptide substrate
Meas. Tech.
Protease Inhibition Assay
pH
4.7±n/a
Temperature
310.15±n/a K
Ki
0.9±0.1 nM
Km
14000±1000 nM
kcat
7.2±0.4 1/sec
Citation
 Clemente, JCHemrajani, RBlum, LEGoodenow, MMDunn, BM Secondary mutations M36I and A71V in the human immunodeficiency virus type 1 protease can provide an advantage for the emergence of the primary mutation D30N. Biochemistry 42:15029-35 (2003)  
Target
Name:
Dimer of Gag-Pol polyprotein [501-599,M537I]
Synonyms:
HIV-1 Protease Mutant (M36I)
Type:
Protein Complex
Mol. Mass.:
Description:
Components:
This complex has 2 components.
Component 1
Name:
Gag-Pol polyprotein [501-599,M537I]
Synonyms:
HIV-1 Protease Mutant (M36I) chain A LAI (M36I) gag-pol
Type:
Enzyme Subunit
Mol. Mass.:
10777.15
Organism:
Human immunodeficiency virus type 1
Description:
P03367[501-599,M537I]
Residue:
99
  
Component 2
Name:
Gag-Pol polyprotein [501-599,M537I]
Synonyms:
HIV-1 Protease Mutant (M36I) chain A LAI (M36I) gag-pol
Type:
Enzyme Subunit
Mol. Mass.:
10777.15
Organism:
Human immunodeficiency virus type 1
Description:
P03367[501-599,M537I]
Residue:
99
  
Inhibitor
Name:
BDBM518
Synonyms:
(3S,4aS,8aS)-N-tert-butyl-2-[(2R,3R)-2-hydroxy-3-[(3-hydroxy-2-methylphenyl)formamido]-4-(phenylsulfanyl)butyl]-decahydroisoquinoline-3-carboxamide CHEMBL584 Viracept
Type:
Small organic molecule
Emp. Form.:
C32H45N3O4S
Mol. Mass.:
567.782
SMILES:
Cc1c(O)cccc1C(=O)N[C@@H](CSc1ccccc1)[C@H](O)CN1C[C@H]2CCCC[C@H]2C[C@H]1C(=O)NC(C)(C)C
:
Substrate
Name:
Chromogenic peptide substrate
Synonyms:
Chromogenic peptide substrate
Type:
Peptide
Mol. Mass.:
1420.11
Organism:
Description:
Residue:
13
KARVLNPHEANLG