Target
Coagulation factor XI
Ligand
BDBM32804
Substrate
Boc-Glu-Ala-Arg-AMC
Meas. Tech.
Factor XIa 1536 HTS Dose Response Confirmation
pH
7.4±n/a
Temperature
296.15±n/a K
IC50
3812.873333±896.87748 nM
Citation
 PubChem, PC Factor XIa 1536 HTS Dose Response Confirmation PubChem Bioassay (2008)[AID] 
Target
Name:
Coagulation factor XI
Synonyms:
Coagulation factor XIa Coagulation factor XIa light chain FA11_HUMAN Factor XIa PTA | Plasma thromboplastin antecedent
Type:
Enzyme
Mol. Mass.:
70130.58
Organism:
Homo sapiens (Human)
Description:
P03951
Residue:
625
  
Inhibitor
Name:
BDBM32804
Synonyms:
2-[[(1S)-1-[[(1S)-1-[(1-formyl-4-guanidino-butyl)carbamoyl]-2-methyl-propyl]carbamoyl]-4-guanidino-butyl]carbamoylamino]-3-phenyl-propionic acid 2-[[(2S)-5-[bis(azanyl)methylideneamino]-1-[[(2S)-1-[[5-[bis(azanyl)methylideneamino]-1-oxidanylidene-pentan-2-yl]amino]-3-methyl-1-oxidanylidene-butan-2-yl]amino]-1-oxidanylidene-pentan-2-yl]carbamoylamino]-3-phenyl-propanoic acid ANTIPAIN SMR000059007 | cid_6852398
Type:
Small organic molecule
Emp. Form.:
C27H44N10O6
Mol. Mass.:
604.7017
SMILES:
[#6]-[#6](-[#6])-[#6@H](-[#7]-[#6](=O)-[#6@H](-[#6]-[#6]-[#6]\[#7]=[#6](\[#7])-[#7])-[#7]-[#6](=O)-[#7]-[#6](-[#6]-c1ccccc1)-[#6](-[#8])=O)-[#6](=O)-[#7]-[#6](-[#6]-[#6]-[#6]\[#7]=[#6](\[#7])-[#7])-[#6]=O
:
Substrate
Name:
Boc-Glu-Ala-Arg-AMC
Synonyms:
Type:
fluorescent substrate peptide
Mol. Mass.:
358.43
Organism:
Description:
Residue:
3
NA