Target
Serine/threonine-protein kinase Chk1
Ligand
BDBM33217
Substrate
biotinylated CDC25C peptide
Meas. Tech.
CHK Kinase Inhibition Assay
pH
7.5±n/a
Temperature
296.15±n/a K
IC50
860±n/a nM
Citation
 Matthews, TPKlair, SBurns, SBoxall, KCherry, MFisher, MWestwood, IMWalton, MIMcHardy, TCheung, KMVan Montfort, RWilliams, DAherne, GWGarrett, MDReader, JCollins, I Identification of inhibitors of checkpoint kinase 1 through template screening. J Med Chem 52:4810-9 (2009)  
Target
Name:
Serine/threonine-protein kinase Chk1
Synonyms:
CHEK1 CHK1 checkpoint homolog Checkpoint kinase-1 (CHK1)
Type:
Enzyme Catalytic Domain
Mol. Mass.:
54443.02
Organism:
Homo sapiens (Human)
Description:
gi_166295192
Residue:
476
  
Inhibitor
Name:
BDBM33217
Synonyms:
pyrazolopyridine, (S)-14
Type:
Small organic molecule
Emp. Form.:
C17H19N5O
Mol. Mass.:
309.3657
SMILES:
NC[C@H]1CN(CCO1)c1c(cnc2[nH]ncc12)-c1ccccc1
:
Substrate
Name:
biotinylated CDC25C peptide
Synonyms:
Type:
biotinylated peptide
Mol. Mass.:
3148.69
Organism:
Description:
Residue:
27