Target
Bromodomain-containing protein 4 [42-168]
Ligand
BDBM209490
Substrate
Meas. Tech.
BRD4-H4 Tetraacetylated Peptide Inhibition AlphaScreen
IC50
13.0±n/a nM
Citation
 Engelhardt, HGianni, DSmethurst, C Substituted [1,2,4]triazolo[4,3-a]pyrazines as BRD4 inhibitors US Patent  US10328074 Publication Date 6/25/2019 
Target
Name:
Bromodomain-containing protein 4 [42-168]
Synonyms:
BRD4 BRD4_HUMAN HUNK1
Type:
Enzyme Catalytic Domain
Mol. Mass.:
15054.68
Organism:
Homo sapiens (Human)
Description:
O60885[42-168]
Residue:
127
  
Inhibitor
Name:
BDBM209490
Synonyms:
US10328074, Example III-31 US9266891, III-31
Type:
Small organic molecule
Emp. Form.:
C23H26N10
Mol. Mass.:
442.5195
SMILES:
CC(C)Nc1nc(cn2c(C)nnc12)-c1nc2cnc(cc2n1Cc1ccccn1)N(C)C
: