Target
Bromodomain-containing protein 4 [42-168]
Ligand
BDBM209496
Substrate
Meas. Tech.
BRD4-H4 Tetraacetylated Peptide Inhibition AlphaScreen
IC50
14.0±n/a nM
Citation
 Engelhardt, HGianni, DSmethurst, C Substituted [1,2,4]triazolo[4,3-a]pyrazines as BRD4 inhibitors US Patent  US10328074 Publication Date 6/25/2019 
Target
Name:
Bromodomain-containing protein 4 [42-168]
Synonyms:
BRD4 BRD4_HUMAN HUNK1
Type:
Enzyme Catalytic Domain
Mol. Mass.:
15054.68
Organism:
Homo sapiens (Human)
Description:
O60885[42-168]
Residue:
127
  
Inhibitor
Name:
BDBM209496
Synonyms:
US10328074, Example III-37 US9266891, III-37
Type:
Small organic molecule
Emp. Form.:
C21H21N9
Mol. Mass.:
399.4517
SMILES:
CC(C)Nc1nc(cn2c(C)nnc12)-c1nc2cnccc2n1Cc1ccccn1
: