Target
Carbonic anhydrase
Ligand
BDBM10880
Substrate
BDBM10856
Meas. Tech.
CA Inhibition Assay
pH
8.3±n/a
Temperature
293.15±n/a K
Ki
132±n/a nM
Citation
 Innocenti, AHall, RASchlicker, CScozzafava, ASteegborn, CMühlschlegel, FASupuran, CT Carbonic anhydrase inhibitors. Inhibition and homology modeling studies of the fungal beta-carbonic anhydrase from Candida albicans with sulfonamides. Bioorg Med Chem 17:4503-9 (2009)  
Target
Name:
Carbonic anhydrase
Synonyms:
CAN_CANAL beta-Carbonic Anhydrase
Type:
Enzyme
Mol. Mass.:
31587.59
Organism:
Candida albicans (Yeast)
Description:
Residue:
281
  
Inhibitor
Name:
BDBM10880
Synonyms:
AZA AZM acetazolamide Acetazolamide Acetazolamide (AZA) Acetazolamide, 5 Acetazolamide, AZA CHEMBL20 Sulfonamide, 1 US11278534, Example acetazolamide sulfonamide 1
Type:
Small organic molecule
Emp. Form.:
C4H6N4O3S2
Mol. Mass.:
222.245
SMILES:
CC(=O)Nc1nnc(s1)S(N)(=O)=O
:
Substrate
Name:
BDBM10856
Synonyms:
Carbon Dioxide | methanedione
Type:
Small organic molecule
Emp. Form.:
CO2
Mol. Mass.:
44.0095
SMILES:
O=C=O
: