Target
Bcl-2-related protein A1
Ligand
BDBM32047
Substrate
FITC-Ahx-EDIIRNIARHLAQVGDSMDR
Meas. Tech.
HTS discovery of chemical inhibitors of anti-apoptotic protein Bfl-1
pH
7±n/a
Temperature
296.15±n/a K
IC50
3491.2±0 nM
Citation
 PubChem, PC HTS discovery of chemical inhibitors of anti-apoptotic protein Bfl-1 PubChem Bioassay (2008)[AID] 
Target
Name:
Bcl-2-related protein A1
Synonyms:
A1 B-cell leukemia/lymphoma 2 related protein A1a Bcl2a1 Bfl-1 Hemopoietic-specific early response protein | Protein BFL-1
Type:
Apoptosis regulator protein
Mol. Mass.:
19909.74
Organism:
Mus musculus (Mouse)
Description:
gi_11024684
Residue:
172
  
Inhibitor
Name:
BDBM32047
Synonyms:
(5-amino-6-quinolyl)amine SMR000015817 quinoline-5,6-diamine
Type:
Small organic molecule
Emp. Form.:
C9H9N3
Mol. Mass.:
159.1879
SMILES:
Nc1ccc2ncccc2c1N
:
Substrate
Name:
FITC-Ahx-EDIIRNIARHLAQVGDSMDR
Synonyms:
FITC-Bid peptide
Type:
fluorescein-labeled peptide
Mol. Mass.:
358.43
Organism:
Description:
Residue:
3
NA