Target
Mannose-6-phosphate isomerase
Ligand
BDBM34778
Substrate
Mannose-6-phosphate
Meas. Tech.
HTS identification of compounds inhibiting phosphomannose isomerase (PMI) via a fluorescence intensity assay using a high concentration of mannose 6-phosphate
pH
7.4±n/a
Temperature
296.15±n/a K
IC50
>50000±0 nM
Citation
 PubChem, PC HTS identification of compounds inhibiting phosphomannose isomerase (PMI) via a fluorescence intensity assay using a high concentration of mannose 6-phosphate PubChem Bioassay (2009)[AID] 
Target
Name:
Mannose-6-phosphate isomerase
Synonyms:
MPI MPI_HUMAN PMI1
Type:
PROTEIN
Mol. Mass.:
46651.35
Organism:
Homo sapiens (Human)
Description:
ChEMBL_1448919
Residue:
423
  
Inhibitor
Name:
BDBM34778
Synonyms:
2-chloranyl-3-[[4-(dimethylamino)phenyl]amino]naphthalene-1,4-dione 2-chloro-3-[4-(dimethylamino)anilino]naphthalene-1,4-dione MLS000584180 cid_260557
Type:
Small organic molecule
Emp. Form.:
C18H15ClN2O2
Mol. Mass.:
326.777
SMILES:
CN(C)c1ccc(NC2=C(Cl)C(=O)c3ccccc3C2=O)cc1
:
Substrate
Name:
Mannose-6-phosphate
Synonyms:
Type:
Mol. Mass.:
358.43
Organism:
Description:
Residue:
3
NA