Target
Serine/threonine-protein kinase pim-2
Ligand
BDBM35050
Substrate
Biotinylated Substrate Peptide
Meas. Tech.
Pim Kinase Assay
Temperature
298.15±n/a K
Ki
0.9±n/a nM
Comments
extracted
Citation
 Tao, ZFHasvold, LALeverson, JDHan, EKGuan, RJohnson, EFStoll, VSStewart, KDStamper, GSoni, NBouska, JJLuo, YSowin, TJLin, NHGiranda, VSRosenberg, SHPenning, TD Discovery of 3H-benzo[4,5]thieno[3,2-d]pyrimidin-4-ones as potent, highly selective, and orally bioavailable inhibitors of the human protooncogene proviral insertion site in moloney murine leukemia virus (PIM) kinases. J Med Chem 52:6621-36 (2009)  
Target
Name:
Serine/threonine-protein kinase pim-2
Synonyms:
PIM2 Pim-2h Serine/threonine-protein kinase PIM | Serine/threonine-protein kinase pim-2 (PIM2)
Type:
Serine/threonine-protein kinase
Mol. Mass.:
34185.93
Organism:
Homo sapiens (Human)
Description:
Q9P1W9
Residue:
311
  
Inhibitor
Name:
BDBM35050
Synonyms:
benzothienopyrimidinone deriv., 20e
Type:
Small organic molecule
Emp. Form.:
C20H21N3O2S
Mol. Mass.:
367.465
SMILES:
O[C@H]1CCN(Cc2nc3c4cc(\C=C\C5CC5)ccc4sc3c(=O)[nH]2)C1
:
Substrate
Name:
Ryanodine receptor 1 [4317-4329]
Synonyms:
Biotinylated Substrate Peptide RYR1 | RYR1_HUMAN
Type:
Peptide
Mol. Mass.:
2871.44
Organism:
Description:
P21817[4317-4329]
Residue:
24