Target
Tyrosine-protein kinase receptor UFO
Ligand
BDBM350848
Substrate
Meas. Tech.
Inhibition Assay
IC50
23.0±n/a nM
Citation
 Wang, XZhang, WFrye, S Therapeutic uses of selected pyrrolopyrimidine compounds with anti-mer tyrosine kinase activity US Patent  US10004755 Publication Date 6/26/2018 
Target
Name:
Tyrosine-protein kinase receptor UFO
Synonyms:
AXL TEL/AXL UFO | UFO_HUMAN
Type:
Enzyme
Mol. Mass.:
98316.97
Organism:
Homo sapiens (Human)
Description:
P30530
Residue:
894
  
Inhibitor
Name:
BDBM350848
Synonyms:
UNC2078A US9795606, B7
Type:
Small organic molecule
Emp. Form.:
C27H37N5O3S
Mol. Mass.:
511.679
SMILES:
CCCCNc1ncc2c(cn(C3CC[C@H](O)CC3)c2n1)-c1ccc(cc1)S(=O)(=O)N1CCCCC1
: