Target
Sodium-dependent noradrenaline transporter
Ligand
BDBM35230
Substrate
BDBM22417
Meas. Tech.
Radioligand Binding Assay (Ki)
pH
7.4±n/a
Temperature
310.15±n/a K
Ki
9±n/a nM
Citation
 Heffernan, GDCoghlan, RDManas, ESMcDevitt, RELi, YMahaney, PERobichaud, AJHuselton, CAlfinito, PBray, JACosmi, SAJohnston, GHKenney, TKoury, EWinneker, RCDeecher, DCTrybulski, EJ Dual acting norepinephrine reuptake inhibitors and 5-HT(2A) receptor antagonists: Identification, synthesis and activity of novel 4-aminoethyl-3-(phenylsulfonyl)-1H-indoles. Bioorg Med Chem 17:7802-15 (2009)  
Target
Name:
Sodium-dependent noradrenaline transporter
Synonyms:
Monoamine transporter NET Noradrenaline Transporter (NET) Norepinephrine transporter protein (NET) SLC6A2 Sodium-dependent noradrenaline transporter (NET) | Solute carrier family 6 member 2
Type:
Multi-pass membrane protein
Mol. Mass.:
69337.72
Organism:
Homo sapiens (Human)
Description:
P23975
Residue:
617
  
Inhibitor
Name:
BDBM35230
Synonyms:
indole, 14
Type:
Small organic molecule
Emp. Form.:
C19H22N2O
Mol. Mass.:
294.3908
SMILES:
CNC[C@@H](O)[C@H](c1ccccc1)n1cc(C)c2ccccc12
:
Substrate
Name:
BDBM22417
Synonyms:
3-(2-methoxyphenoxy)-N-methyl-3-phenylpropan-1-amine LY 135252 LY135252 Nisoxetine US9944618, Compound ID No. 177 [3H]Nisoxetine
Type:
radiolabeled ligand
Emp. Form.:
C17H21NO2
Mol. Mass.:
271.3541
SMILES:
CNCCC(Oc1ccccc1OC)c1ccccc1
: