Target
Neutrophil elastase
Ligand
BDBM35268
Substrate
BDBM35258
Meas. Tech.
Neutrophil Elastase (HNE) Inhibition Assay
pH
7.5±n/a
Temperature
310.15±n/a K
IC50
23±n/a nM
Citation
 Inoue, YOmodani, TShiratake, ROkazaki, HKuromiya, AKubo, TSato, F Development of a highly water-soluble peptide-based human neutrophil elastase inhibitor; AE-3763 for treatment of acute organ injury. Bioorg Med Chem 17:7477-86 (2009)  
Target
Name:
Neutrophil elastase
Synonyms:
Bone marrow serine protease Coagulation factor X ELANE Elastase HLE Leukocyte elastase Medullasin Neutrophil elastase (HNE) PMN elastase Trypsin
Type:
Enzyme
Mol. Mass.:
28532.38
Organism:
Homo sapiens (Human)
Description:
P08246
Residue:
267
  
Inhibitor
Name:
BDBM35268
Synonyms:
tripeptide-based inhibitor, 14k
Type:
Small organic molecule
Emp. Form.:
C31H40N6O9
Mol. Mass.:
640.6841
SMILES:
CC(C)[C@H](NC(=O)CN1C(=O)N(CC(O)=O)C(C)(C)C1=O)C(=O)N1CCC[C@H]1C(=O)N[C@@H](C(C)C)C(=O)c1nc2ccccc2o1
:
Substrate
Name:
BDBM35258
Synonyms:
Suc-Ala-Pro-Ala-MCA
Type:
fluorogenic substrate
Emp. Form.:
Mol. Mass.:
SMILES:
: