Target
Mitogen-activated protein kinase 14
Ligand
BDBM35323
Substrate
biotinylated GST-ATF2
Meas. Tech.
Homogeneous Time-Resolved Fluorescence (HTRF) Enzyme Assay
pH
7.5±n/a
Temperature
296.15±n/a K
IC50
350±n/a nM
Citation
 Smith, ALDeMorin, FFParas, NAHuang, QPetkus, JKDoherty, EMNixey, TKim, JLWhittington, DAEpstein, LFLee, MRRose, MJBabij, CFernando, MHess, KLe, QBeltran, PCarnahan, J Selective inhibitors of the mutant B-Raf pathway: discovery of a potent and orally bioavailable aminoisoquinoline. J Med Chem 52:6189-92 (2009)  
Target
Name:
Mitogen-activated protein kinase 14
Synonyms:
CSAID-binding protein CSBP1 CSPB1 MAP kinase 14 MAP kinase p38 alpha MAPK14 MK14_HUMAN Mitogen-activated protein kinase p38 alpha Stress-activated protein kinase 2a | p38 MAP kinase alpha/beta
Type:
Serine/threonine-protein kinase
Mol. Mass.:
41286.76
Organism:
Homo sapiens (Human)
Description:
Q16539
Residue:
360
  
Inhibitor
Name:
BDBM35323
Synonyms:
aminoisoquinoline, 16
Type:
Small organic molecule
Emp. Form.:
C28H24N8S
Mol. Mass.:
504.609
SMILES:
CNc1cc(ncn1)-c1cccnc1Nc1c(C)ccc2c(Nc3ccc4sc(C)nc4c3)nccc12
:
Substrate
Name:
biotinylated GST-ATF2
Synonyms:
ATF-2-GST Activating transcription factor 2 GST-ATF2 biotinylated activating transcription factor 2
Type:
Other Protein Type
Mol. Mass.:
12237.77
Organism:
Homo sapiens (Human)
Description:
Residue:
109