Target
Tyrosine-protein kinase Lck
Ligand
BDBM35321
Substrate
Gastrin Peptide Substrate
Meas. Tech.
In Vitro BRAF Kinase Assay
IC50
150±n/a nM
Citation
 Smith, ALDeMorin, FFParas, NAHuang, QPetkus, JKDoherty, EMNixey, TKim, JLWhittington, DAEpstein, LFLee, MRRose, MJBabij, CFernando, MHess, KLe, QBeltran, PCarnahan, J Selective inhibitors of the mutant B-Raf pathway: discovery of a potent and orally bioavailable aminoisoquinoline. J Med Chem 52:6189-92 (2009)  
Target
Name:
Tyrosine-protein kinase Lck
Synonyms:
2.7.10.2 LCK_HUMAN Leukocyte C-terminal Src kinase Lymphocyte-specific protein tyrosine kinase Protein YT16 Proto-oncogene tyrosine-protein kinase LCK T cell-specific protein-tyrosine kinase
Type:
Mol. Mass.:
57987.83
Organism:
Homo sapiens (Human)
Description:
P06239
Residue:
509
  
Inhibitor
Name:
BDBM35321
Synonyms:
aminoisoquinoline, 14
Type:
Small organic molecule
Emp. Form.:
C27H22N8
Mol. Mass.:
458.5172
SMILES:
CNc1cc(ncn1)-c1cccnc1Nc1c(C)ccc2c(Nc3ccc(cc3)C#N)nccc12
:
Substrate
Name:
Gastrin Peptide Substrate
Synonyms:
Biotinylated gastrin peptide substrate gastrin substrate
Type:
Peptide
Mol. Mass.:
1823.88
Organism:
Description:
Residue:
15
ITINEEEEAYGWLDF