Target
Angiopoietin-1 receptor
Ligand
BDBM14971
Substrate
Her2 Peptide Substrate
Meas. Tech.
In Vitro BRAF Kinase Assay
IC50
3.6±n/a nM
Citation
 Smith, ALDeMorin, FFParas, NAHuang, QPetkus, JKDoherty, EMNixey, TKim, JLWhittington, DAEpstein, LFLee, MRRose, MJBabij, CFernando, MHess, KLe, QBeltran, PCarnahan, J Selective inhibitors of the mutant B-Raf pathway: discovery of a potent and orally bioavailable aminoisoquinoline. J Med Chem 52:6189-92 (2009)  
Target
Name:
Angiopoietin-1 receptor
Synonyms:
TEK TIE2_HUMAN Tyrosine-protein kinase receptor (TIE-2) Tyrosine-protein kinase receptor TEK (p140 TEK) Tyrosine-protein kinase receptor TIE2/TEK VMCM1 p140 TEK
Type:
Enzyme
Mol. Mass.:
125835.70
Organism:
Homo sapiens (Human)
Description:
Q02763
Residue:
1124
  
Inhibitor
Name:
BDBM14971
Synonyms:
4-Methyl-3-(3-(pyrimidin-4-yl)pyridin-2-ylamino)-N-(3-(trifluoromethyl)phenyl)benzamide JMC526189 Compound 2 | pyridinyl pyrimidine 6
Type:
Small organic molecule
Emp. Form.:
C24H18F3N5O
Mol. Mass.:
449.4278
SMILES:
Cc1ccc(cc1Nc1ncccc1-c1ccncn1)C(=O)Nc1cccc(c1)C(F)(F)F
:
Substrate
Name:
Her2 Peptide Substrate
Synonyms:
Biotinylated Her2 Peptide Substrate | biotinylated long chain peptide
Type:
Peptide
Mol. Mass.:
2278.65
Organism:
Description:
Residue:
20