Target
Angiopoietin-1 receptor
Ligand
BDBM35327
Substrate
Her2 Peptide Substrate
Meas. Tech.
In Vitro BRAF Kinase Assay
IC50
120±n/a nM
Citation
 Smith, ALDeMorin, FFParas, NAHuang, QPetkus, JKDoherty, EMNixey, TKim, JLWhittington, DAEpstein, LFLee, MRRose, MJBabij, CFernando, MHess, KLe, QBeltran, PCarnahan, J Selective inhibitors of the mutant B-Raf pathway: discovery of a potent and orally bioavailable aminoisoquinoline. J Med Chem 52:6189-92 (2009)  
Target
Name:
Angiopoietin-1 receptor
Synonyms:
TEK TIE2_HUMAN Tyrosine-protein kinase receptor (TIE-2) Tyrosine-protein kinase receptor TEK (p140 TEK) Tyrosine-protein kinase receptor TIE2/TEK VMCM1 p140 TEK
Type:
Enzyme
Mol. Mass.:
125835.70
Organism:
Homo sapiens (Human)
Description:
Q02763
Residue:
1124
  
Inhibitor
Name:
BDBM35327
Synonyms:
pyridylpurine aminoisoquinoline, 1
Type:
Small organic molecule
Emp. Form.:
C26H19ClN8
Mol. Mass.:
478.936
SMILES:
Cc1ccc2c(Nc3ccc(Cl)cc3)nccc2c1Nc1ncccc1-c1ncnc2nc[nH]c12
:
Substrate
Name:
Her2 Peptide Substrate
Synonyms:
Biotinylated Her2 Peptide Substrate | biotinylated long chain peptide
Type:
Peptide
Mol. Mass.:
2278.65
Organism:
Description:
Residue:
20