Target
Genome polyprotein
Ligand
BDBM35557
Substrate
poly(A)/oligo(U)18
Meas. Tech.
HCV RNA-Dependent RNA Polymerase Assay (IC50)
pH
7.5±n/a
Temperature
296.15±n/a K
IC50
190±n/a nM
Citation
 Ontoria, JMRydberg, EHDi Marco, STomei, LAttenni, BMalancona, SMartin Hernando, JIGennari, NKoch, UNarjes, FRowley, MSumma, VCarroll, SSOlsen, DBDe Francesco, RAltamura, SMigliaccio, GCarfì, A Identification and Biological Evaluation of a Series of 1H-Benzo[de]isoquinoline-1,3(2H)-diones as Hepatitis C Virus NS5B Polymerase Inhibitors. J Med Chem 52:5217-27 (2009)  
Target
Name:
Genome polyprotein
Synonyms:
Genome polyprotein POLG_HCVBK | RNA-directed RNA polymerase (NS5B)
Type:
Protein
Mol. Mass.:
327252.46
Organism:
Hepatitis C virus genotype 1b (isolate BK) (HCV)
Description:
P26663
Residue:
3010
  
Inhibitor
Name:
BDBM35557
Synonyms:
1H-benzo[de]isoquinoline-1,3(2H)-dione, 6
Type:
Small organic molecule
Emp. Form.:
C18H11BrN2O2
Mol. Mass.:
367.196
SMILES:
Nc1ccc2C(=O)N(C(=O)c3cccc1c23)c1cccc(Br)c1
:
Substrate
Name:
poly(A)/oligo(U)18
Synonyms:
Type:
homopolymeric template/primer
Mol. Mass.:
358.43
Organism:
Description:
UTP/3H-UTP as co-substrate.
Residue:
3
NA