Target
Genome polyprotein
Ligand
BDBM35571
Substrate
poly(A)/oligo(U)18
Meas. Tech.
HCV RNA-Dependent RNA Polymerase Assay (IC50)
IC50
110±n/a nM
Citation
 Ontoria, JMRydberg, EHDi Marco, STomei, LAttenni, BMalancona, SMartin Hernando, JIGennari, NKoch, UNarjes, FRowley, MSumma, VCarroll, SSOlsen, DBDe Francesco, RAltamura, SMigliaccio, GCarfì, A Identification and Biological Evaluation of a Series of 1H-Benzo[de]isoquinoline-1,3(2H)-diones as Hepatitis C Virus NS5B Polymerase Inhibitors. J Med Chem 52:5217-27 (2009)  
Target
Name:
Genome polyprotein
Synonyms:
HCV NS5B Polymerase RNA-directed RNA polymerase, C-terminally truncated form delta C21
Type:
Enzyme catalytic domain
Mol. Mass.:
330236.08
Organism:
Hepatitis C virus genotype 2b (isolate HC-J8) (HCV)
Description:
P26661
Residue:
3033
  
Inhibitor
Name:
BDBM35571
Synonyms:
1H-benzo[de]isoquinoline-1,3(2H)-dione, 20 | cis-isomers
Type:
Small organic molecule
Emp. Form.:
C25H21BrN2O4
Mol. Mass.:
493.349
SMILES:
OC(=O)[C@@H]1CC[C@@H](CC1)Nc1ccc2C(=O)N(C(=O)c3cccc1c23)c1cccc(Br)c1
:
Substrate
Name:
poly(A)/oligo(U)18
Synonyms:
Type:
homopolymeric template/primer
Mol. Mass.:
358.43
Organism:
Description:
UTP/3H-UTP as co-substrate.
Residue:
3
NA