Target
Dimer of Gag-Pol polyprotein [489-587]
Ligand
BDBM833
Substrate
HIV-1 Peptide Substrate
Meas. Tech.
Protease Inhibition Assay
pH
5.5±n/a
Temperature
303.15±n/a K
IC50
130±12 nM
Citation
 Lyle, TAWiscount, CMGuare, JPThompson, WJAnderson, PSDarke, PLZugay, ZAEmini, EASchleif, WAQunitero, JC Benzocycloalkyl amines as novel C-termini for HIV protease inhibitors. J Med Chem 34:1228-30 (1991)  
Target
Name:
Dimer of Gag-Pol polyprotein [489-587]
Synonyms:
HIV-1 Protease
Type:
Protein Complex
Mol. Mass.:
Description:
Components:
This complex has 2 components.
Component 1
Name:
Gag-Pol polyprotein [489-587]
Synonyms:
HIV protease HIV-1 Protease chain A POL_HV1N5 | gag-pol
Type:
Enzyme Subunit
Mol. Mass.:
10822.21
Organism:
Human immunodeficiency virus type 1
Description:
P12497[489-587]
Residue:
99
  
Component 2
Name:
Gag-Pol polyprotein [489-587]
Synonyms:
HIV protease HIV-1 Protease chain A POL_HV1N5 | gag-pol
Type:
Enzyme Subunit
Mol. Mass.:
10822.21
Organism:
Human immunodeficiency virus type 1
Description:
P12497[489-587]
Residue:
99
  
Inhibitor
Name:
BDBM833
Synonyms:
Benzocycloalkyl Amines deriv. 3 CHEMBL439725 | tert-butyl N-[(2S,3S,5R)-5-benzyl-5-(2,3-dihydro-1H-inden-2-ylcarbamoyl)-3-hydroxy-1-phenylpentan-2-yl]carbamate
Type:
Small organic molecule
Emp. Form.:
C33H40N2O4
Mol. Mass.:
528.6817
SMILES:
CC(C)(C)OC(=O)N[C@@H](Cc1ccccc1)[C@@H](O)C[C@@H](Cc1ccccc1)C(=O)NC1Cc2ccccc2C1
:
Substrate
Name:
HIV-1 Peptide Substrate
Synonyms:
Type:
Peptide
Mol. Mass.:
4618.57
Organism:
Description:
Residue:
43