Target
Dimer of Gag-Pol polyprotein [489-587]
Ligand
BDBM838
Substrate
HIV-1 Peptide Substrate
Meas. Tech.
Protease Inhibition Assay
pH
5.5±n/a
Temperature
303.15±n/a K
IC50
259±n/a nM
Citation
 Lyle, TAWiscount, CMGuare, JPThompson, WJAnderson, PSDarke, PLZugay, ZAEmini, EASchleif, WAQunitero, JC Benzocycloalkyl amines as novel C-termini for HIV protease inhibitors. J Med Chem 34:1228-30 (1991)  
Target
Name:
Dimer of Gag-Pol polyprotein [489-587]
Synonyms:
HIV-1 Protease
Type:
Protein Complex
Mol. Mass.:
Description:
Components:
This complex has 2 components.
Component 1
Name:
Gag-Pol polyprotein [489-587]
Synonyms:
HIV protease HIV-1 Protease chain A POL_HV1N5 | gag-pol
Type:
Enzyme Subunit
Mol. Mass.:
10822.21
Organism:
Human immunodeficiency virus type 1
Description:
P12497[489-587]
Residue:
99
  
Component 2
Name:
Gag-Pol polyprotein [489-587]
Synonyms:
HIV protease HIV-1 Protease chain A POL_HV1N5 | gag-pol
Type:
Enzyme Subunit
Mol. Mass.:
10822.21
Organism:
Human immunodeficiency virus type 1
Description:
P12497[489-587]
Residue:
99
  
Inhibitor
Name:
BDBM838
Synonyms:
Benzocycloalkyl Amines deriv. 8 | tert-butyl N-[(2S,3S,5R)-5-benzyl-3-hydroxy-5-{[(1S,2S)-2-hydroxy-2,3-dihydro-1H-inden-1-yl]carbamoyl}-1-phenylpentan-2-yl]carbamate
Type:
Small organic molecule
Emp. Form.:
C33H40N2O5
Mol. Mass.:
544.6811
SMILES:
CC(C)(C)OC(=O)N[C@@H](Cc1ccccc1)[C@@H](O)C[C@@H](Cc1ccccc1)C(=O)N[C@@H]1[C@@H](O)Cc2ccccc12
:
Substrate
Name:
HIV-1 Peptide Substrate
Synonyms:
Type:
Peptide
Mol. Mass.:
4618.57
Organism:
Description:
Residue:
43