Target
Vasopressin V1a receptor
Ligand
BDBM35681
Substrate
BDBM35667
Meas. Tech.
Binding Assay for Human V2 Receptor
Temperature
298.15±n/a K
Ki
22±n/a nM
Comments
extracted
Citation
 Tsukamoto, IKoshio, HKuramochi, TSaitoh, CYanai-Inamura, HKitada-Nozawa, CYamamoto, EYatsu, TShimada, YSakamoto, STsukamoto, S Synthesis and structure-activity relationships of amide derivatives of (4,4-difluoro-1,2,3,4-tetrahydro-5H-1-benzazepin-5-ylidene)acetic acid as selective arginine vasopressin V2 receptor agonists. Bioorg Med Chem 17:3130-41 (2009)  
Target
Name:
Vasopressin V1a receptor
Synonyms:
AVPR V1a AVPR1A V1AR_HUMAN VASOPRESSIN V1A Vasopressin V1 receptor Vasopressin receptor
Type:
Receptor
Mol. Mass.:
46820.18
Organism:
Homo sapiens (Human)
Description:
P37288
Residue:
418
  
Inhibitor
Name:
BDBM35681
Synonyms:
5H-1-benzazepin-5-ylidene acetamide, 1i
Type:
Small organic molecule
Emp. Form.:
C30H23ClF2N6O2
Mol. Mass.:
572.992
SMILES:
Cc1ccn(n1)-c1ccc(C(=O)N2CCC(F)(F)\C(=C/C(=O)NCc3cccc(n3)C#N)c3ccccc23)c(Cl)c1
:
Substrate
Name:
BDBM35667
Synonyms:
AVP US10131692, 44 (AVP) [3H]Argipressin tannate | [3H]vasopressin
Type:
radiolabeled ligand
Emp. Form.:
C46H65N15O12S2
Mol. Mass.:
1084.232
SMILES:
[#7]-[#6@H]-1-[#6]-[#16]-[#16]-[#6]-[#6@H](-[#7]-[#6](=O)-[#6@H](-[#6]-[#6](-[#7])=O)-[#7]-[#6](=O)-[#6@H](-[#6]-[#6]-[#6](-[#7])=O)-[#7]-[#6](=O)-[#6@H](-[#6]-c2ccccc2)-[#7]-[#6](=O)-[#6@H](-[#6]-c2ccc(-[#8])cc2)-[#7]-[#6]-1=O)-[#6](=O)-[#7]-1-[#6]-[#6]-[#6]-[#6@H]-1-[#6](=O)-[#7]-[#6@@H](-[#6]-[#6]-[#6]\[#7]=[#6](\[#7])-[#7])-[#6](=O)-[#7]-[#6]-[#6](-[#7])=O
: