Target
Dimer of Gag-Pol polyprotein [489-587]
Ligand
BDBM885
Substrate
HIV-1 Peptide Substrate
Meas. Tech.
Protease Inhibition Assay
pH
5.5±n/a
Temperature
303.15±n/a K
IC50
2.1±n/a nM
Citation
 Thompson, WJFitzgerald, PMHolloway, MKEmini, EADarke, PLMcKeever, BMSchleif, WAQuintero, JCZugay, JATucker, TJ Synthesis and antiviral activity of a series of HIV-1 protease inhibitors with functionality tethered to the P1 or P1' phenyl substituents: X-ray crystal structure assisted design. J Med Chem 35:1685-701 (1992)  
Target
Name:
Dimer of Gag-Pol polyprotein [489-587]
Synonyms:
HIV-1 Protease
Type:
Protein Complex
Mol. Mass.:
Description:
Components:
This complex has 2 components.
Component 1
Name:
Gag-Pol polyprotein [489-587]
Synonyms:
HIV protease HIV-1 Protease chain A POL_HV1N5 | gag-pol
Type:
Enzyme Subunit
Mol. Mass.:
10822.21
Organism:
Human immunodeficiency virus type 1
Description:
P12497[489-587]
Residue:
99
  
Component 2
Name:
Gag-Pol polyprotein [489-587]
Synonyms:
HIV protease HIV-1 Protease chain A POL_HV1N5 | gag-pol
Type:
Enzyme Subunit
Mol. Mass.:
10822.21
Organism:
Human immunodeficiency virus type 1
Description:
P12497[489-587]
Residue:
99
  
Inhibitor
Name:
BDBM885
Synonyms:
L-685,434 deriv. 33 tert-butyl N-[(2S,3S,5R)-5-({4-[2-(dimethylamino)ethoxy]phenyl}methyl)-3-hydroxy-5-{[(1S,2R)-2-hydroxy-2,3-dihydro-1H-inden-1-yl]carbamoyl}-1-phenylpentan-2-yl]carbamate
Type:
Small organic molecule
Emp. Form.:
C37H49N3O6
Mol. Mass.:
631.8015
SMILES:
CN(C)CCOc1ccc(C[C@H](C[C@H](O)[C@H](Cc2ccccc2)NC(=O)OC(C)(C)C)C(=O)N[C@@H]2[C@H](O)Cc3ccccc23)cc1
:
Substrate
Name:
HIV-1 Peptide Substrate
Synonyms:
Type:
Peptide
Mol. Mass.:
4333.31
Organism:
Description:
Residue:
40