Target
Androgen receptor
Ligand
BDBM35898
Substrate
BDBM18161
Meas. Tech.
SPA Binding Assay (IC50) and Coactivator Peptide Competitive FP Assay (IC50/EC50)
pH
7.2±n/a
Temperature
296.15±n/a K
IC50
21900±3200 nM
EC50
>100000±n/a nM
Citation
 Féau, CArnold, LAKosinski, AZhu, FConnelly, MGuy, RK Novel flufenamic acid analogues as inhibitors of androgen receptor mediated transcription. ACS Chem Biol 4:834-43 (2009)  
Target
Name:
Androgen receptor
Synonyms:
ANDR_HUMAN Androgen Receptor Androgen receptor/Baculoviral IAP repeat-containing protein 2 Dihydrotestosterone receptor Nuclear receptor subfamily 3 group C member 4
Type:
Receptor
Mol. Mass.:
99185.27
Organism:
Homo sapiens (Human)
Description:
CHO cells were stably transfected with human AR gene.
Residue:
920
  
Inhibitor
Name:
BDBM35898
Synonyms:
flufenamic acid analogue, 25
Type:
Small organic molecule
Emp. Form.:
C13H10N2O4
Mol. Mass.:
258.2295
SMILES:
OC(=O)c1ccccc1Nc1ccccc1[N+]([O-])=O
:
Substrate
Name:
BDBM18161
Synonyms:
(1S,2S,7S,10R,11S,14S,15S)-14-hydroxy-2,15-dimethyltetracyclo[8.7.0.0^{2,7}.0^{11,15}]heptadecan-5-one CHEMBL27769 Dihydrotestosterone | [3H]DHT
Type:
Steroid
Emp. Form.:
C19H30O2
Mol. Mass.:
290.4403
SMILES:
[H][C@@]12CC[C@H](O)[C@@]1(C)CC[C@@]1([H])[C@@]2([H])CC[C@@]2([H])CC(=O)CC[C@]12C
: