Target
Carbonic anhydrase 2
Ligand
BDBM36004
Substrate
Meas. Tech.
SPR biosensor assay Biacore T100
pH
7.4±n/a
Temperature
298.15±n/a K
Kd
394±n/a nM
KOFF
272000 s-1
KON
0.1073 M-1s-1
Citation
 Navratilova, IHopkins, AL Fragment Screening by Surface Plasmon Resonance ACS Med Chem Lett 1:44-8 (2010)   
Target
Name:
Carbonic anhydrase 2
Synonyms:
CA2 Carbonic anhydrase Carbonic anhydrase II Carbonic anhydrase II (CA-II)
Type:
Enzyme Catalytic Domain
Mol. Mass.:
29115.93
Organism:
Bos taurus
Description:
Residue:
260
  
Inhibitor
Name:
BDBM36004
Synonyms:
2,4-difluorobenzene-1-sulfonamide | SPR_8
Type:
Small organic molecule
Emp. Form.:
C6H5F2NO2S
Mol. Mass.:
193.171
SMILES:
NS(=O)(=O)c1ccc(F)cc1F
: