Target
Kinesin-like protein KIF11 [D130V]
Ligand
BDBM50220156
Substrate
Meas. Tech.
HCT116-D130V IC50 biaryl selected
pH
6.8±0
IC50
1190±0.0 nM
Citation
 Luo, LParrish, CANevins, NMcNulty, DEChaudhari, AMCarson, JDSudakin, VShaw, ANLehr, RZhao, HSweitzer, SLad, LWood, KWSakowicz, RAnnan, RSHuang, PSJackson, JRDhanak, DCopeland, RAAuger, KR ATP-competitive inhibitors of the mitotic kinesin KSP that function via an allosteric mechanism. Nat Chem Biol 3:722-6 (2007)  
Target
Name:
Kinesin-like protein KIF11 [D130V]
Synonyms:
EG5 KIF11_HUMAN KSP Mutant (D130V) kinesin spindle protein Mutant (D130V)
Type:
PROTEIN
Mol. Mass.:
119124.02
Organism:
Homo sapiens (Human)
Description:
Kinesin-like spindle protein HKSP
Residue:
1056
  
Inhibitor
Name:
BDBM50220156
Synonyms:
(R)-N-(3-aminopropyl)-N-(1-(3-benzyl-7-chloro-4-oxo-3,4-dihydroquinazolin-2-yl)-2-methylpropyl)-3-fluoro-4-methylbenzamide SB-731489
Type:
Small organic molecule
Emp. Form.:
C30H32ClFN4O2
Mol. Mass.:
535.052
SMILES:
CC(C)[C@@H](N(CCCN)C(=O)c1ccc(C)c(F)c1)c1nc2cc(Cl)ccc2c(=O)n1Cc1ccccc1
: