Target
Kinesin-like protein KIF11 [A356T]
Ligand
BDBM36350
Substrate
Meas. Tech.
WT-6x
pH
6.8±0
Ki
66±5 nM
Citation
 Luo, LParrish, CANevins, NMcNulty, DEChaudhari, AMCarson, JDSudakin, VShaw, ANLehr, RZhao, HSweitzer, SLad, LWood, KWSakowicz, RAnnan, RSHuang, PSJackson, JRDhanak, DCopeland, RAAuger, KR ATP-competitive inhibitors of the mitotic kinesin KSP that function via an allosteric mechanism. Nat Chem Biol 3:722-6 (2007)  
Target
Name:
Kinesin-like protein KIF11 [A356T]
Synonyms:
EG5 KIF11_HUMAN KSP Mutant (A356T) kinesin spindle protein Mutant (A356T)
Type:
PROTEIN
Mol. Mass.:
119168.99
Organism:
Homo sapiens (Human)
Description:
Kinesin-like spindle protein HKSP, Kinesin-related motor protein Eg5 (A356T)
Residue:
1056
  
Inhibitor
Name:
BDBM36350
Synonyms:
6-[4-(Trifluoromethyl)phenyl]-3,4-dihydro-2(1H)-quinolinone GSK-1
Type:
Small organic molecule
Emp. Form.:
C16H12F3NO
Mol. Mass.:
291.2678
SMILES:
FC(F)(F)c1ccc(cc1)-c1ccc2NC(=O)CCc2c1
: