Target
Receptor protein serine/threonine kinase
Ligand
BDBM36352
Substrate
poly(Glu4, Tyr)
Meas. Tech.
Kinase assay Dorsalization
EC50
5e+3±n/a nM
Citation
 Hao, JHo, JNLewis, JAKarim, KADaniels, RNGentry, PRHopkins, CRLindsley, CWHong, CC In vivo structure-activity relationship study of dorsomorphin analogues identifies selective VEGF and BMP inhibitors. ACS Chem Biol 5:245-53 (2010)  
Target
Name:
Receptor protein serine/threonine kinase
Synonyms:
B3DJG0 Bmpr1a protein | Bone morphogenetic protein
Type:
Mol. Mass.:
59502.00
Organism:
Danio rerio (Zebrafish)
Description:
B3DJG0
Residue:
526
  
Inhibitor
Name:
BDBM36352
Synonyms:
dorsomorphin (6LE)
Type:
Small organic molecule
Emp. Form.:
C22H23N5O
Mol. Mass.:
373.4509
SMILES:
CN(C)CCCOc1ccc(cc1)-c1cnc2c(cnn2c1)-c1ccncc1
:
Substrate
Name:
poly(Glu4, Tyr)
Synonyms:
Type:
Random copolymer
Mol. Mass.:
358.43
Organism:
Description:
Residue:
3
NA