Target
Receptor protein serine/threonine kinase
Ligand
BDBM50262079
Substrate
poly(Glu4, Tyr)
Meas. Tech.
Kinase assay intersomitic vessel (ISV) disruption
EC50
2.0e+4±n/a nM
Citation
 Hao, JHo, JNLewis, JAKarim, KADaniels, RNGentry, PRHopkins, CRLindsley, CWHong, CC In vivo structure-activity relationship study of dorsomorphin analogues identifies selective VEGF and BMP inhibitors. ACS Chem Biol 5:245-53 (2010)  
Target
Name:
Receptor protein serine/threonine kinase
Synonyms:
B3DJG0 Bmpr1a protein | Bone morphogenetic protein
Type:
Mol. Mass.:
59502.00
Organism:
Danio rerio (Zebrafish)
Description:
B3DJG0
Residue:
526
  
Inhibitor
Name:
BDBM50262079
Synonyms:
4-(6-(4-(piperazin-1-yl)phenyl)pyrazolo[1,5-a]pyrimidin-3-yl)quinoline CHEMBL513147 | LDN-193189
Type:
Small organic molecule
Emp. Form.:
C25H22N6
Mol. Mass.:
406.4824
SMILES:
C1CN(CCN1)c1ccc(cc1)-c1cnc2c(cnn2c1)-c1ccnc2ccccc12
:
Substrate
Name:
poly(Glu4, Tyr)
Synonyms:
Type:
Random copolymer
Mol. Mass.:
358.43
Organism:
Description:
Residue:
3
NA