Target
Activin receptor type-1
Ligand
BDBM36356
Substrate
poly(Glu4, Tyr)
Meas. Tech.
in vitro Kinase Assay
IC50
26.7±0.0 nM
Citation
 Hao, JHo, JNLewis, JAKarim, KADaniels, RNGentry, PRHopkins, CRLindsley, CWHong, CC In vivo structure-activity relationship study of dorsomorphin analogues identifies selective VEGF and BMP inhibitors. ACS Chem Biol 5:245-53 (2010)  
Target
Name:
Activin receptor type-1
Synonyms:
2.7.11.30 ACVR1 ACVRLK2 ALK2/ACVR1 Activin receptor-like kinase 2 Activin receptor-like kinase 2 (ALK2/ACVR1) SKR1 TGF-B superfamily receptor type I | TSR-I
Type:
Mol. Mass.:
57158.32
Organism:
Homo sapiens (Human)
Description:
Residue:
509
  
Inhibitor
Name:
BDBM36356
Synonyms:
DMH3 US9040694, 3
Type:
Small organic molecule
Emp. Form.:
C26H25N5O
Mol. Mass.:
423.5096
SMILES:
CN(C)CCCOc1ccc(cc1)-c1cnc2c(cnn2c1)-c1ccnc2ccccc12
:
Substrate
Name:
poly(Glu4, Tyr)
Synonyms:
Type:
Random copolymer
Mol. Mass.:
358.43
Organism:
Description:
Residue:
3
NA