Target
5'-AMP-activated protein kinase subunit beta-1/5'-AMP-activated protein kinase subunit gamma-1/Dual specificity protein kinase CLK2
Ligand
BDBM36356
Substrate
poly(Glu4, Tyr)
Meas. Tech.
in vitro Kinase Assay
IC50
1940.0±0.0 nM
Citation
 Hao, JHo, JNLewis, JAKarim, KADaniels, RNGentry, PRHopkins, CRLindsley, CWHong, CC In vivo structure-activity relationship study of dorsomorphin analogues identifies selective VEGF and BMP inhibitors. ACS Chem Biol 5:245-53 (2010)  
Target
Name:
5'-AMP-activated protein kinase subunit beta-1/5'-AMP-activated protein kinase subunit gamma-1/Dual specificity protein kinase CLK2
Synonyms:
AMP-activated protein kinase (AMPK)
Type:
PROTEIN
Mol. Mass.:
Description:
Components:
This complex has 3 components.
Component 1
Name:
Dual specificity protein kinase CLK2
Synonyms:
2.7.12.1 CDC-like kinase 2 (CLK2) CLK2 | CLK2_HUMAN
Type:
Mol. Mass.:
60128.79
Organism:
Homo sapiens (Human)
Description:
P49760
Residue:
499
  
Component 2
Name:
5'-AMP-activated protein kinase subunit beta-1
Synonyms:
5'-AMP-activated protein kinase subunit beta-1 AMP-activated protein kinase alpha-2/beta-1/gamma-3 AMPK subunit beta-1 PRKAB1
Type:
Mol. Mass.:
30380.94
Organism:
Homo sapiens (Human)
Description:
Q9Y478
Residue:
270
  
Component 3
Name:
5'-AMP-activated protein kinase subunit gamma-1
Synonyms:
5'-AMP-activated protein kinase subunit gamma-1 AMP-activated protein kinase, gamma-1 subunit AMPK gamma-1 AMPK subunit gamma-1 PRKAG1
Type:
Mol. Mass.:
37581.44
Organism:
Homo sapiens (Human)
Description:
P54619
Residue:
331
  
Inhibitor
Name:
BDBM36356
Synonyms:
DMH3 US9040694, 3
Type:
Small organic molecule
Emp. Form.:
C26H25N5O
Mol. Mass.:
423.5096
SMILES:
CN(C)CCCOc1ccc(cc1)-c1cnc2c(cnn2c1)-c1ccnc2ccccc12
:
Substrate
Name:
poly(Glu4, Tyr)
Synonyms:
Type:
Random copolymer
Mol. Mass.:
358.43
Organism:
Description:
Residue:
3
NA