Target
Kaposi's sarcoma-associated herpesvirus cyclin homolog
Ligand
BDBM36459
Substrate
Meas. Tech.
KSHV Pr Inhibition Assay
pH
8±0
Temperature
303.15±0 K
IC50
8.8e+3± 3e+2 nM
Citation
 Shahian, TLee, GMLazic, AArnold, LAVelusamy, PRoels, CMGuy, RKCraik, CS Inhibition of a viral enzyme by a small-molecule dimer disruptor. Nat Chem Biol 5:640-6 (2009)  
Target
Name:
Kaposi's sarcoma-associated herpesvirus cyclin homolog
Synonyms:
Kaposi's sarcoma-associated herpesvirus (KSHV)
Type:
Enzyme
Mol. Mass.:
28080.00
Organism:
Human herpesvirus 8 (HHV-8) (Kaposi's sarcoma-associated herpesvirus)
Description:
Q98147
Residue:
257
  
Inhibitor
Name:
BDBM36459
Synonyms:
3-Benzyl-4-(3-(cyclohexylmethyl)benzamido)benzoic acid, 1 | CID42628631
Type:
Small organic molecule
Emp. Form.:
C28H29NO3
Mol. Mass.:
427.5348
SMILES:
OC(=O)c1ccc(NC(=O)c2cccc(CC3CCCCC3)c2)c(Cc2ccccc2)c1
: