Target
Dimer of Gag-Pol polyprotein [489-587]
Ligand
BDBM1027
Substrate
Peptide substrate
Meas. Tech.
Protease Inhibition Assay
pH
5.5±n/a
Temperature
303.15±n/a K
IC50
6.00±n/a nM
Citation
 Young, SDPayne, LSThompson, WJGaffin, NLyle, TABritcher, SFGraham, SLSchultz, THDeana, AADarke, PL HIV-1 protease inhibitors based on hydroxyethylene dipeptide isosteres: an investigation into the role of the P1' side chain on structure-activity. J Med Chem 35:1702-9 (1992)  
Target
Name:
Dimer of Gag-Pol polyprotein [489-587]
Synonyms:
HIV-1 Protease
Type:
Protein Complex
Mol. Mass.:
Description:
Components:
This complex has 2 components.
Component 1
Name:
Gag-Pol polyprotein [489-587]
Synonyms:
HIV protease HIV-1 Protease chain A POL_HV1N5 | gag-pol
Type:
Enzyme Subunit
Mol. Mass.:
10822.21
Organism:
Human immunodeficiency virus type 1
Description:
P12497[489-587]
Residue:
99
  
Component 2
Name:
Gag-Pol polyprotein [489-587]
Synonyms:
HIV protease HIV-1 Protease chain A POL_HV1N5 | gag-pol
Type:
Enzyme Subunit
Mol. Mass.:
10822.21
Organism:
Human immunodeficiency virus type 1
Description:
P12497[489-587]
Residue:
99
  
Inhibitor
Name:
BDBM1027
Synonyms:
Hydroxyethylene dipeptide isostere 10 | tert-butyl N-[(2S,3S,5R)-5-{[(1S)-1-{[(1S)-1-carbamoyl-2-phenylethyl]carbamoyl}-3-methylbutyl]carbamoyl}-3-hydroxy-5-methyl-1-phenylpentan-2-yl]carbamate
Type:
Small organic molecule
Emp. Form.:
C33H48N4O6
Mol. Mass.:
596.7574
SMILES:
CC(C)C[C@H](NC(=O)[C@H](C)C[C@H](O)[C@H](Cc1ccccc1)NC(=O)OC(C)(C)C)C(=O)N[C@@H](Cc1ccccc1)C(N)=O
:
Substrate
Name:
Peptide substrate
Synonyms:
Type:
Peptide
Mol. Mass.:
3774.14
Organism:
Description:
Residue:
34