Target
Dimer of Gag-Pol polyprotein [489-587]
Ligand
BDBM1042
Substrate
Peptide substrate
Meas. Tech.
Protease Inhibition Assay
pH
5.5±n/a
Temperature
303.15±n/a K
IC50
0.22±n/a nM
Citation
 Young, SDPayne, LSThompson, WJGaffin, NLyle, TABritcher, SFGraham, SLSchultz, THDeana, AADarke, PL HIV-1 protease inhibitors based on hydroxyethylene dipeptide isosteres: an investigation into the role of the P1' side chain on structure-activity. J Med Chem 35:1702-9 (1992)  
Target
Name:
Dimer of Gag-Pol polyprotein [489-587]
Synonyms:
HIV-1 Protease
Type:
Protein Complex
Mol. Mass.:
Description:
Components:
This complex has 2 components.
Component 1
Name:
Gag-Pol polyprotein [489-587]
Synonyms:
HIV protease HIV-1 Protease chain A POL_HV1N5 | gag-pol
Type:
Enzyme Subunit
Mol. Mass.:
10822.21
Organism:
Human immunodeficiency virus type 1
Description:
P12497[489-587]
Residue:
99
  
Component 2
Name:
Gag-Pol polyprotein [489-587]
Synonyms:
HIV protease HIV-1 Protease chain A POL_HV1N5 | gag-pol
Type:
Enzyme Subunit
Mol. Mass.:
10822.21
Organism:
Human immunodeficiency virus type 1
Description:
P12497[489-587]
Residue:
99
  
Inhibitor
Name:
BDBM1042
Synonyms:
Hydroxyethylene dipeptide isostere 34 | tert-butyl N-[(2S,3S,5R)-3-hydroxy-5-{[(1S,2R)-2-hydroxy-2,3-dihydro-1H-inden-1-yl]carbamoyl}-5-{[4-(methylsulfanyl)phenyl]methyl}-1-phenylpentan-2-yl]carbamate
Type:
Small organic molecule
Emp. Form.:
C34H42N2O5S
Mol. Mass.:
590.773
SMILES:
[H][C@@]1(NC(=O)[C@@H](C[C@H](O)[C@H](Cc2ccccc2)NC(=O)OC(C)(C)C)Cc2ccc(SC)cc2)[C@H](O)Cc2ccccc12
:
Substrate
Name:
Peptide substrate
Synonyms:
Type:
Peptide
Mol. Mass.:
3774.14
Organism:
Description:
Residue:
34