Target
HIV-1 protease
Ligand
BDBM36649
Substrate
Meas. Tech.
Protease Inhibtion Assay
pH
5.5±0
Ki
0.018±0.0 nM
Citation
 Rodgers, JDLam, PYJohnson, BLWang, HLi, RRu, YKo, SSSeitz, SPTrainor, GLAnderson, PSKlabe, RMBacheler, LTCordova, BGarber, SReid, CWright, MRChang, CHErickson-Viitanen, S Design and selection of DMP 850 and DMP 851: the next generation of cyclic urea HIV protease inhibitors. Chem Biol 5:597-608 (1998)  
Target
Name:
HIV-1 protease
Synonyms:
HIV-1 protease wild type
Type:
Protein
Mol. Mass.:
10757.68
Organism:
Human immunodeficiency virus
Description:
O90785
Residue:
99
  
Inhibitor
Name:
BDBM36649
Synonyms:
3-alkylaminoindazole cyclic urea, (Me)
Type:
Small organic molecule
Emp. Form.:
C37H40N8O3
Mol. Mass.:
644.7653
SMILES:
CNc1n[nH]c2ccc(CN3[C@H](Cc4ccccc4)[C@H](O)[C@@H](O)[C@@H](Cc4ccccc4)N(Cc4ccc5[nH]nc(NC)c5c4)C3=O)cc12
: