Target
HIV-1 protease
Ligand
BDBM36654
Substrate
Meas. Tech.
Protease Inhibtion Assay
pH
5.5±0
Ki
1.30±0.0 nM
Citation
 Rodgers, JDLam, PYJohnson, BLWang, HLi, RRu, YKo, SSSeitz, SPTrainor, GLAnderson, PSKlabe, RMBacheler, LTCordova, BGarber, SReid, CWright, MRChang, CHErickson-Viitanen, S Design and selection of DMP 850 and DMP 851: the next generation of cyclic urea HIV protease inhibitors. Chem Biol 5:597-608 (1998)  
Target
Name:
HIV-1 protease
Synonyms:
HIV-1 protease wild type
Type:
Protein
Mol. Mass.:
10757.68
Organism:
Human immunodeficiency virus
Description:
O90785
Residue:
99
  
Inhibitor
Name:
BDBM36654
Synonyms:
3-alkylaminoindazole cyclic urea, (-(CH2)4-)
Type:
Small organic molecule
Emp. Form.:
C43H48N8O3
Mol. Mass.:
724.893
SMILES:
O[C@@H]1[C@@H](O)[C@@H](Cc2ccccc2)N(Cc2ccc3[nH]nc(NC4CCC4)c3c2)C(=O)N(Cc2ccc3[nH]nc(NC4CCC4)c3c2)[C@@H]1Cc1ccccc1
: