Target
Gag polyprotein
Ligand
BDBM36657
Substrate
Meas. Tech.
Enzyme Inhibtion Assay
pH
6.5±0
IC50
12±0.0 nM
Citation
 Rodgers, JDLam, PYJohnson, BLWang, HLi, RRu, YKo, SSSeitz, SPTrainor, GLAnderson, PSKlabe, RMBacheler, LTCordova, BGarber, SReid, CWright, MRChang, CHErickson-Viitanen, S Design and selection of DMP 850 and DMP 851: the next generation of cyclic urea HIV protease inhibitors. Chem Biol 5:597-608 (1998)  
Target
Name:
Gag polyprotein
Synonyms:
GAG_HV1MN | gag
Type:
Protein
Mol. Mass.:
56781.96
Organism:
Human immunodeficiency virus type 1 group M subtype B (isolate MN) (HIV-1)
Description:
P05888
Residue:
507
  
Inhibitor
Name:
BDBM36657
Synonyms:
2-Naphthylmethyl cyclic urea
Type:
Small organic molecule
Emp. Form.:
C38H37N5O3
Mol. Mass.:
611.7321
SMILES:
Nc1n[nH]c2ccc(CN3[C@H](Cc4ccccc4)[C@H](O)[C@@H](O)[C@@H](Cc4ccccc4)N(Cc4ccc5ccccc5c4)C3=O)cc12
: