Target
Tyrosine-protein kinase ABL1 [1-999,Q252H]
Ligand
BDBM15244
Substrate
Meas. Tech.
Kinase Inhibitor Selectivity Profiling Assay
Kd
2200000±n/a nM
Citation
 PubChem, PC Kinase Inhibitor Selectivity Profiling Assay PubChem Bioassay (2008)[AID] 
Target
Name:
Tyrosine-protein kinase ABL1 [1-999,Q252H]
Synonyms:
ABL ABL1(Q252H) JTK7 Tyrosine-protein kinase ABL (dephosphorylated)
Type:
Enzyme Catalytic Domain
Mol. Mass.:
108590.01
Organism:
Homo sapiens (Human)
Description:
gi_62362414
Residue:
999
  
Inhibitor
Name:
BDBM15244
Synonyms:
5-(2,6-dichlorophenyl)-2-(2,4-difluorophenyl)sulfanylpyrimido[1,6-b]pyridazin-6-one 5-(2,6-dichlorophenyl)-2-[(2,4-difluorophenyl)thio]-6-pyrimido[1,6-b]pyridazinone 5-(2,6-dichlorophenyl)-9-(2,4-difluorophenyl)sulfanyl-1,3,10-triazabicyclo[4.4.0]deca-2,5,7,9-tetraen-4-one VX-745 cid_3038525
Type:
Small organic molecule
Emp. Form.:
C19H9Cl2F2N3OS
Mol. Mass.:
436.262
SMILES:
Fc1ccc(Sc2ccc3c(-c4c(Cl)cccc4Cl)c(=O)ncn3n2)c(F)c1
: