Target
Dimer of Gag-Pol polyprotein [489-587]
Ligand
BDBM1174
Substrate
Peptide Substrate
Meas. Tech.
Protease Inhibition Assay
pH
5±n/a
Temperature
295.15±n/a K
Ki
1.6±n/a nM
Citation
 Thaisrivongs, SJanakiraman, MNChong, KTTomich, PKDolak, LATurner, SRStrohbach, JWLynn, JCHorng, MMHinshaw, RRWatenpaugh, KD Structure-based design of novel HIV protease inhibitors: sulfonamide-containing 4-hydroxycoumarins and 4-hydroxy-2-pyrones as potent non-peptidic inhibitors. J Med Chem 39:2400-10 (1996)  
Target
Name:
Dimer of Gag-Pol polyprotein [489-587]
Synonyms:
HIV-1 Protease
Type:
Protein Complex
Mol. Mass.:
Description:
Components:
This complex has 2 components.
Component 1
Name:
Gag-Pol polyprotein [489-587]
Synonyms:
HIV protease HIV-1 Protease chain A POL_HV1N5 | gag-pol
Type:
Enzyme Subunit
Mol. Mass.:
10822.21
Organism:
Human immunodeficiency virus type 1
Description:
P12497[489-587]
Residue:
99
  
Component 2
Name:
Gag-Pol polyprotein [489-587]
Synonyms:
HIV protease HIV-1 Protease chain A POL_HV1N5 | gag-pol
Type:
Enzyme Subunit
Mol. Mass.:
10822.21
Organism:
Human immunodeficiency virus type 1
Description:
P12497[489-587]
Residue:
99
  
Inhibitor
Name:
BDBM1174
Synonyms:
N-[3-[Cyclopropyl[6-[3-(2-methoxyethoxy)propyl]-4-hydroxy-2-oxo-2H-pyran-3-yl)methyl]phenyl]-1-methyl-1H-imidazole-4-sulfonamide Sulfonamide-Containing 4-Hydroxy-2-pyrone deriv. XIV
Type:
Small organic molecule
Emp. Form.:
C25H31N3O7S
Mol. Mass.:
517.595
SMILES:
COCCOCCCc1cc(O)c(C(C2CC2)c2cccc(NS(=O)(=O)c3cn(C)cn3)c2)c(=O)o1
:
Substrate
Name:
Peptide Substrate
Synonyms:
Type:
Peptide
Mol. Mass.:
1447.64
Organism:
Description:
The peptide was derivatized with biotin and fluorescein isothiocyanate at the amino and carboxy termini.
Residue:
12
RVSQNYPIVQNK