Target
Dimer of Gag-Pol polyprotein [489-587]
Ligand
BDBM1176
Substrate
Peptide Substrate
Meas. Tech.
Protease Inhibition Assay
pH
5±n/a
Temperature
295.15±n/a K
Ki
1.0±n/a nM
Citation
 Thaisrivongs, SJanakiraman, MNChong, KTTomich, PKDolak, LATurner, SRStrohbach, JWLynn, JCHorng, MMHinshaw, RRWatenpaugh, KD Structure-based design of novel HIV protease inhibitors: sulfonamide-containing 4-hydroxycoumarins and 4-hydroxy-2-pyrones as potent non-peptidic inhibitors. J Med Chem 39:2400-10 (1996)  
Target
Name:
Dimer of Gag-Pol polyprotein [489-587]
Synonyms:
HIV-1 Protease
Type:
Protein Complex
Mol. Mass.:
Description:
Components:
This complex has 2 components.
Component 1
Name:
Gag-Pol polyprotein [489-587]
Synonyms:
HIV protease HIV-1 Protease chain A POL_HV1N5 | gag-pol
Type:
Enzyme Subunit
Mol. Mass.:
10822.21
Organism:
Human immunodeficiency virus type 1
Description:
P12497[489-587]
Residue:
99
  
Component 2
Name:
Gag-Pol polyprotein [489-587]
Synonyms:
HIV protease HIV-1 Protease chain A POL_HV1N5 | gag-pol
Type:
Enzyme Subunit
Mol. Mass.:
10822.21
Organism:
Human immunodeficiency virus type 1
Description:
P12497[489-587]
Residue:
99
  
Inhibitor
Name:
BDBM1176
Synonyms:
N-(3-{cyclopropyl[6-(1,3-dicyclopropylpropan-2-yl)-4-hydroxy-2-oxo-2H-pyran-3-yl]methyl}phenyl)-1-methyl-1H-imidazole-4-sulfonamide Sulfonamide-Containing 4-Hydroxy-2-pyrone deriv. XVI
Type:
Small organic molecule
Emp. Form.:
C28H33N3O5S
Mol. Mass.:
523.644
SMILES:
Cn1cnc(c1)S(=O)(=O)Nc1cccc(c1)C(C1CC1)c1c(O)cc(oc1=O)C(CC1CC1)CC1CC1
:
Substrate
Name:
Peptide Substrate
Synonyms:
Type:
Peptide
Mol. Mass.:
1447.64
Organism:
Description:
The peptide was derivatized with biotin and fluorescein isothiocyanate at the amino and carboxy termini.
Residue:
12
RVSQNYPIVQNK