Target
Dimer of Gag-Pol polyprotein [489-587]
Ligand
BDBM1251
Substrate
decapeptide substrate
Meas. Tech.
Protease Inhibition Assay
pH
5.5±n/a
Temperature
310.15±n/a K
IC50
3.6±n/a nM
Citation
 Beaulieu, PLWernic, DAbraham, AAnderson, PCBogri, TBousquet, YCroteau, GGuse, ILamarre, DLiard, FParis, WThibeault, DPav, STong, L Potent HIV protease inhibitors containing a novel (hydroxyethyl)amide isostere. J Med Chem 40:2164-76 (1997)  
Target
Name:
Dimer of Gag-Pol polyprotein [489-587]
Synonyms:
HIV-1 Protease
Type:
Protein Complex
Mol. Mass.:
Description:
Components:
This complex has 2 components.
Component 1
Name:
Gag-Pol polyprotein [489-587]
Synonyms:
HIV protease HIV-1 Protease chain A POL_HV1N5 | gag-pol
Type:
Enzyme Subunit
Mol. Mass.:
10822.21
Organism:
Human immunodeficiency virus type 1
Description:
P12497[489-587]
Residue:
99
  
Component 2
Name:
Gag-Pol polyprotein [489-587]
Synonyms:
HIV protease HIV-1 Protease chain A POL_HV1N5 | gag-pol
Type:
Enzyme Subunit
Mol. Mass.:
10822.21
Organism:
Human immunodeficiency virus type 1
Description:
P12497[489-587]
Residue:
99
  
Inhibitor
Name:
BDBM1251
Synonyms:
(2R)-2-tert-butyl-N-[(2R,3S)-2-hydroxy-3-[(2S,3R)-3-hydroxy-2-(quinolin-2-ylformamido)butanamido]-4-phenylbutyl]-N'-(pentan-3-yl)butanediamide | (Hydroxyethyl)amidosuccinoyl deriv. 23
Type:
Small organic molecule
Emp. Form.:
C37H51N5O6
Mol. Mass.:
661.8307
SMILES:
CCC(CC)NC(=O)C[C@@H](C(=O)NC[C@@H](O)[C@H](Cc1ccccc1)NC(=O)[C@@H](NC(=O)c1ccc2ccccc2n1)C(C)O)C(C)(C)C
:
Substrate
Name:
decapeptide substrate
Synonyms:
Type:
Peptide
Mol. Mass.:
1417.08
Organism:
Description:
Residue:
12
VSFNFPQITLNH