Target
Dimer of Gag-Pol polyprotein [489-587]
Ligand
BDBM1254
Substrate
Peptide substrate
Meas. Tech.
Protease Inhibition Assay
pH
5.5±n/a
Temperature
303.15±n/a K
IC50
550±n/a nM
Citation
 deSolms, SJGiuliani, EAGuare, JPVacca, JPSanders, WMGraham, SLWiggins, JMDarke, PLSigal, ISZugay, JA Design and synthesis of HIV protease inhibitors. Variations of the carboxy terminus of the HIV protease inhibitor L-682,679. J Med Chem 34:2852-7 (1991)  
Target
Name:
Dimer of Gag-Pol polyprotein [489-587]
Synonyms:
HIV-1 Protease
Type:
Tandem linked enzyme construct
Mol. Mass.:
Description:
Components:
This complex has 2 components.
Component 1
Name:
Gag-Pol polyprotein [489-587]
Synonyms:
Human immunodeficiency virus type 1 protease Pol polyprotein | gag-pol
Type:
Enzyme Subunit
Mol. Mass.:
10781.16
Organism:
Human immunodeficiency virus type 1
Description:
P04585[489-587]
Residue:
99
  
Component 2
Name:
Gag-Pol polyprotein [489-587]
Synonyms:
Human immunodeficiency virus type 1 protease Pol polyprotein | gag-pol
Type:
Enzyme Subunit
Mol. Mass.:
10781.16
Organism:
Human immunodeficiency virus type 1
Description:
P04585[489-587]
Residue:
99
  
Inhibitor
Name:
BDBM1254
Synonyms:
L-682, 679 analog 13 | tert-butyl N-[(2S,3S,5R)-5-benzyl-5-[(carbamoylmethyl)carbamoyl]-3-hydroxy-1-phenylpentan-2-yl]carbamate
Type:
Small organic molecule
Emp. Form.:
C26H35N3O5
Mol. Mass.:
469.5732
SMILES:
CC(C)(C)OC(=O)N[C@@H](Cc1ccccc1)[C@@H](O)C[C@@H](Cc1ccccc1)C(=O)NCC(N)=O
:
Substrate
Name:
Peptide substrate
Synonyms:
Type:
Peptide
Mol. Mass.:
4618.57
Organism:
Description:
Residue:
43